Reaction Details
TargetCannabinoid receptor 2
LigandBDBM50063925
Substrate/Competitorn/a
Meas. Tech.ChEMBL_1464106 (CHEMBL3406632)
EC50 0.290000±n/a nM
Citation Hickey, ERZindell, RCirillo, PFWu, LErmann, MBerry, AKThomson, DSAlbrecht, CGemkow, MJRiether, D Selective CB2 receptor agonists. Part 1: the identification of novel ligands through computer-aided drug design (CADD) approaches. Bioorg Med Chem Lett25:575-80 (2015) 
 
Cannabinoid receptor 2
Name:Cannabinoid receptor 2
Type:G Protein-Coupled Receptor (GPCR)
Mol. Mass.:39690.94
Organism:Homo sapiens (Human)
Description:P34972
Residue:360
BDBM50063925
NameBDBM50063925
Synonyms:CHEMBL3400944
TypeSmall organic molecule
Emp. Form.C20H24F3N3O2
Mol. Mass.395.4187
SMILESCC(C)(C)c1cc(NC(=O)[C@]2(C)CCCN2c2ccc(cc2)C(F)(F)F)no1