Reaction Details
TargetCannabinoid receptor 2
LigandBDBM50063928
Substrate/Competitorn/a
Meas. Tech.ChEMBL_1464106 (CHEMBL3406632)
EC50 3.0±n/a nM
Citation Hickey, ERZindell, RCirillo, PFWu, LErmann, MBerry, AKThomson, DSAlbrecht, CGemkow, MJRiether, D Selective CB2 receptor agonists. Part 1: the identification of novel ligands through computer-aided drug design (CADD) approaches. Bioorg Med Chem Lett25:575-80 (2015) 
 
Cannabinoid receptor 2
Name:Cannabinoid receptor 2
Type:G Protein-Coupled Receptor (GPCR)
Mol. Mass.:39690.94
Organism:Homo sapiens (Human)
Description:P34972
Residue:360
BDBM50063928
NameBDBM50063928
Synonyms:CHEMBL3400947
TypeSmall organic molecule
Emp. Form.C17H20F3N3O4S
Mol. Mass.419.419
SMILESCC(C)(C)c1cc(NC(=O)C(C)(C)S(=O)(=O)c2ccc(cn2)C(F)(F)F)no1