Reaction Details
TargetCannabinoid receptor 1
LigandBDBM50063901
Substrate/Competitorn/a
Meas. Tech.ChEMBL_1464105 (CHEMBL3406631)
EC50 420±n/a nM
Citation Hickey, ERZindell, RCirillo, PFWu, LErmann, MBerry, AKThomson, DSAlbrecht, CGemkow, MJRiether, D Selective CB2 receptor agonists. Part 1: the identification of novel ligands through computer-aided drug design (CADD) approaches. Bioorg Med Chem Lett25:575-80 (2015) 
 
Cannabinoid receptor 1
Name:Cannabinoid receptor 1
Type:G Protein-Coupled Receptor (GPCR)
Mol. Mass.:52868.96
Organism:Homo sapiens (Human)
Description:P21554
Residue:472
BDBM50063901
NameBDBM50063901
Synonyms:CHEMBL3400937
TypeSmall organic molecule
Emp. Form.C18H21F3N2O4S
Mol. Mass.418.431
SMILESCC(C)(C)c1cc(NC(=O)C(C)(C)S(=O)(=O)c2ccc(cc2)C(F)(F)F)no1