Reaction Details
TargetCannabinoid receptor 1
LigandBDBM50006228
Substrate/Competitorn/a
Meas. Tech.ChEMBL_1464105 (CHEMBL3406631)
EC50>20000±n/a nM
Citation Hickey, ERZindell, RCirillo, PFWu, LErmann, MBerry, AKThomson, DSAlbrecht, CGemkow, MJRiether, D Selective CB2 receptor agonists. Part 1: the identification of novel ligands through computer-aided drug design (CADD) approaches. Bioorg Med Chem Lett25:575-80 (2015) 
 
Cannabinoid receptor 1
Name:Cannabinoid receptor 1
Type:G Protein-Coupled Receptor (GPCR)
Mol. Mass.:52868.96
Organism:Homo sapiens (Human)
Description:P21554
Residue:472
BDBM50006228
NameBDBM50006228
Synonyms:CHEMBL3235056
TypeSmall organic molecule
Emp. Form.C18H21F3N4O2
Mol. Mass.382.3801
SMILESCC(C)(C)c1cc(NC(=O)[C@H]2CCCN2c2ccc(cn2)C(F)(F)F)no1