Reaction Details
TargetCannabinoid receptor 1
LigandBDBM50063926
Substrate/Competitorn/a
Meas. Tech.ChEMBL_1464105 (CHEMBL3406631)
EC50 54±n/a nM
Citation Hickey, ERZindell, RCirillo, PFWu, LErmann, MBerry, AKThomson, DSAlbrecht, CGemkow, MJRiether, D Selective CB2 receptor agonists. Part 1: the identification of novel ligands through computer-aided drug design (CADD) approaches. Bioorg Med Chem Lett25:575-80 (2015) 
 
Cannabinoid receptor 1
Name:Cannabinoid receptor 1
Type:G Protein-Coupled Receptor (GPCR)
Mol. Mass.:52868.96
Organism:Homo sapiens (Human)
Description:P21554
Residue:472
BDBM50063926
NameBDBM50063926
Synonyms:CHEMBL3400945
TypeSmall organic molecule
Emp. Form.C19H24ClN3O2
Mol. Mass.361.866
SMILESCC(C)(C)c1cc(NC(=O)[C@]2(C)CCCN2c2ccc(Cl)cc2)no1