Reaction Details
TargetAmine oxidase [flavin-containing] B
LigandBDBM50037429
Substrate/Competitorn/a
Meas. Tech.ChEMBL_1464353 (CHEMBL3404812)
Ki 210±n/a nM
Citation Rojas, RJEdmondson, DEAlmos, TScott, RMassari, ME Reversible and irreversible small molecule inhibitors of monoamine oxidase B (MAO-B) investigated by biophysical techniques. Bioorg Med Chem23:770-8 (2015) 
 
Amine oxidase [flavin-containing] B
Name:Amine oxidase [flavin-containing] B
Type:Protein
Mol. Mass.:58768.76
Organism:Homo sapiens (Human)
Description:P27338
Residue:520
BDBM50037429
NameBDBM50037429
Synonyms:8-(3-chlorostyryl)caffeine CHEMBL26138 cid_5353365
TypeSmall organic molecule
Emp. Form.C16H15ClN4O2
Mol. Mass.330.769
SMILESCn1c(\C=C\c2cccc(Cl)c2)nc2n(C)c(=O)n(C)c(=O)c12