Reaction Details
TargetAmine oxidase [flavin-containing] B
LigandBDBM50063994
Substrate/Competitorn/a
Meas. Tech.ChEMBL_1464353 (CHEMBL3404812)
Ki 32±n/a nM
Citation Rojas, RJEdmondson, DEAlmos, TScott, RMassari, ME Reversible and irreversible small molecule inhibitors of monoamine oxidase B (MAO-B) investigated by biophysical techniques. Bioorg Med Chem23:770-8 (2015) 
 
Amine oxidase [flavin-containing] B
Name:Amine oxidase [flavin-containing] B
Type:Protein
Mol. Mass.:58768.76
Organism:Homo sapiens (Human)
Description:P27338
Residue:520
BDBM50063994
NameBDBM50063994
Synonyms:CHEMBL338404 | Ro-166491
TypeSmall organic molecule
Emp. Form.C9H11ClN2O
Mol. Mass.198.649
SMILESNCCNC(=O)c1ccc(Cl)cc1