Reaction Details
TargetGlycogen synthase kinase-3 beta
LigandBDBM50064147
Substrate/Competitorn/a
Meas. Tech.ChEMBL_1464792 (CHEMBL3404147)
IC50 30±n/a nM
Citation Fukunaga, KSakai, DWatanabe, KNakayama, KKohara, TTanaka, HSunada, SNabeno, MOkamoto, MSaito, KEguchi, JMori, ATanaka, SInazawa, KHorikawa, T Discovery of novel 2-(alkylmorpholin-4-yl)-6-(3-fluoropyridin-4-yl)-pyrimidin-4(3H)-ones as orally-active GSK-3ß inhibitors for Alzheimer's disease. Bioorg Med Chem Lett25:1086-91 (2015) 
 
Glycogen synthase kinase-3 beta
Name:Glycogen synthase kinase-3 beta
Type:Enzyme
Mol. Mass.:46756.38
Organism:Homo sapiens (Human)
Description:P49841
Residue:420
BDBM50064147
NameBDBM50064147
Synonyms:CHEMBL3401122
TypeSmall organic molecule
Emp. Form.C16H19FN4O2
Mol. Mass.318.3461
SMILESCC[C@H]1COCCN1c1nc(cc(=O)n1C)-c1ccncc1F