Reaction Details
TargetGlycogen synthase kinase-3 beta
LigandBDBM50443871
Substrate/Competitorn/a
Meas. Tech.ChEMBL_1464792 (CHEMBL3404147)
IC50 12±n/a nM
Citation Fukunaga, KSakai, DWatanabe, KNakayama, KKohara, TTanaka, HSunada, SNabeno, MOkamoto, MSaito, KEguchi, JMori, ATanaka, SInazawa, KHorikawa, T Discovery of novel 2-(alkylmorpholin-4-yl)-6-(3-fluoropyridin-4-yl)-pyrimidin-4(3H)-ones as orally-active GSK-3ß inhibitors for Alzheimer's disease. Bioorg Med Chem Lett25:1086-91 (2015) 
 
Glycogen synthase kinase-3 beta
Name:Glycogen synthase kinase-3 beta
Type:Enzyme
Mol. Mass.:46756.38
Organism:Homo sapiens (Human)
Description:P49841
Residue:420
BDBM50443871
NameBDBM50443871
Synonyms:CHEMBL3091536
TypeSmall organic molecule
Emp. Form.C19H18FN5O2
Mol. Mass.367.3769
SMILESCn1c(nc(cc1=O)-c1ccncn1)N1CCO[C@H](C1)c1ccc(F)cc1