Reaction Details
TargetCystathionine beta-synthase
LigandBDBM50064265
Substrate/Competitorn/a
Meas. Tech.ChEMBL_1464805 (CHEMBL3404160)
IC50 170000±n/a nM
Citation Thorson, MKVan Wagoner, RMHarper, MKIreland, CMMajtan, TKraus, JPBarrios, AM Marine natural products as inhibitors of cystathionine beta-synthase activity. Bioorg Med Chem Lett25:1064-6 (2015) 
 
Cystathionine beta-synthase
Name:Cystathionine beta-synthase
Type:PROTEIN
Mol. Mass.:60586.85
Organism:Homo sapiens (Human)
Description:ChEMBL_109567
Residue:551
BDBM50064265
NameBDBM50064265
Synonyms:CHEMBL1956777
TypeSmall organic molecule
Emp. Form.C10H8N2OS
Mol. Mass.204.248
SMILESO=C1NC(=S)N\C1=C/c1ccccc1