Reaction Details
TargetCystathionine beta-synthase
LigandBDBM50064290
Substrate/Competitorn/a
Meas. Tech.ChEMBL_1464805 (CHEMBL3404160)
IC50 125000±n/a nM
Citation Thorson, MKVan Wagoner, RMHarper, MKIreland, CMMajtan, TKraus, JPBarrios, AM Marine natural products as inhibitors of cystathionine beta-synthase activity. Bioorg Med Chem Lett25:1064-6 (2015) 
 
Cystathionine beta-synthase
Name:Cystathionine beta-synthase
Type:PROTEIN
Mol. Mass.:60586.85
Organism:Homo sapiens (Human)
Description:ChEMBL_109567
Residue:551
BDBM50064290
NameBDBM50064290
Synonyms:CHEMBL1956805
TypeSmall organic molecule
Emp. Form.C10H8N2O3S
Mol. Mass.236.247
SMILESOc1ccc(\C=C2/NC(=S)NC2=O)cc1O