Reaction Details
TargetPhosphatidylinositol 4,5-bisphosphate 3-kinase catalytic subunit delta isoform
LigandBDBM50064300
Substrate/Competitorn/a
Meas. Tech.ChEMBL_1464810 (CHEMBL3404165)
IC50 0.100000±n/a nM
Citation Bui, MHao, XShin, YCardozo, MHe, XHenne, KSuchomel, JMcCarter, JMcGee, LRSan Miguel, TMedina, JCMohn, DTran, TWannberg, SWong, JWong, SZalameda, LMetz, DCushing, TD Synthesis and SAR study of potent and selective PI3Kd inhibitors. Bioorg Med Chem Lett25:1104-9 (2015) 
 
Phosphatidylinositol 4,5-bisphosphate 3-kinase catalytic subunit delta isoform
Name:Phosphatidylinositol 4,5-bisphosphate 3-kinase catalytic subunit delta isoform
Type:Enzyme Subunit
Mol. Mass.:119489.41
Organism:Homo sapiens (Human)
Description:O00329
Residue:1044
BDBM50064300
NameBDBM50064300
Synonyms:CHEMBL3403664
TypeSmall organic molecule
Emp. Form.C23H19FN6O2S
Mol. Mass.462.499
SMILESC[C@H](Nc1ncnc(N)c1C#N)c1nc2ccc(F)cc2c(c1-c1ccccc1)S(C)(=O)=O