Reaction Details
TargetPhosphatidylinositol 4,5-bisphosphate 3-kinase catalytic subunit delta isoform
LigandBDBM50403099
Substrate/Competitorn/a
Meas. Tech.ChEMBL_1464810 (CHEMBL3404165)
IC50 0.500000±n/a nM
Citation Bui, MHao, XShin, YCardozo, MHe, XHenne, KSuchomel, JMcCarter, JMcGee, LRSan Miguel, TMedina, JCMohn, DTran, TWannberg, SWong, JWong, SZalameda, LMetz, DCushing, TD Synthesis and SAR study of potent and selective PI3Kd inhibitors. Bioorg Med Chem Lett25:1104-9 (2015) 
 
Phosphatidylinositol 4,5-bisphosphate 3-kinase catalytic subunit delta isoform
Name:Phosphatidylinositol 4,5-bisphosphate 3-kinase catalytic subunit delta isoform
Type:Enzyme Subunit
Mol. Mass.:119489.41
Organism:Homo sapiens (Human)
Description:O00329
Residue:1044
BDBM50403099
NameBDBM50403099
Synonyms:CHEMBL2216892
TypeSmall organic molecule
Emp. Form.C25H24FN7O2S
Mol. Mass.505.567
SMILESC[C@H](Nc1ncnc(N)c1C#N)c1nc2ccc(F)cc2c(NCCS(C)(=O)=O)c1-c1ccccc1