Reaction Details
TargetHeat shock protein HSP 90-alpha
LigandBDBM50064396
Substrate/Competitorn/a
Meas. Tech.ChEMBL_1464910 (CHEMBL3404380)
Ki 41±n/a nM
Citation Neubert, TNuma, MErnst, JClemens, JKrenitsky, PLiu, MFleck, BWoody, LZuccola, HStamos, D Discovery of novel oxazepine and diazepine carboxamides as two new classes of heat shock protein 90 inhibitors. Bioorg Med Chem Lett25:1338-42 (2015) 
 
Heat shock protein HSP 90-alpha
Name:Heat shock protein HSP 90-alpha
Type:Molecular Chaperone
Mol. Mass.:84623.45
Organism:Homo sapiens (Human)
Description:P07900
Residue:732
BDBM50064396
NameBDBM50064396
Synonyms:CHEMBL3401155
TypeSmall organic molecule
Emp. Form.C25H26ClN3O3
Mol. Mass.451.945
SMILESCc1c2CCN(Cc3ccoc3)c3cc(C(N)=O)c(Cl)cc3-n2c2CC(C)(C)CC(=O)c12