Reaction Details
TargetPhosphatidylinositol 4,5-bisphosphate 3-kinase catalytic subunit beta isoform
LigandBDBM50064856
Substrate/Competitorn/a
Meas. Tech.ChEMBL_1465178 (CHEMBL3405879)
IC50 473±n/a nM
Citation Yin, YZhang, YQJin, BSha, SWu, XSangani, CBWang, SFQiao, FLu, AMLv, PCZhu, HL 6,7-Dihydrobenzo[f]benzo[4,5]imidazo[1,2-d][1,4]oxazepine derivatives as selective inhibitors of PI3Ka. Bioorg Med Chem23:1231-40 (2015) 
 
Phosphatidylinositol 4,5-bisphosphate 3-kinase catalytic subunit beta isoform
Name:Phosphatidylinositol 4,5-bisphosphate 3-kinase catalytic subunit beta isoform
Type:Enzyme Subunit
Mol. Mass.:122769.00
Organism:Homo sapiens (Human)
Description:P42338
Residue:1070
BDBM50064856
NameBDBM50064856
Synonyms:CHEMBL3401245
TypeSmall organic molecule
Emp. Form.C15H10BrFN2O
Mol. Mass.333.155
SMILESFc1ccc2n3CCOc4ccc(Br)cc4-c3nc2c1