Reaction Details
TargetPhosphatidylinositol 4,5-bisphosphate 3-kinase catalytic subunit alpha isoform
LigandBDBM50064859
Substrate/Competitorn/a
Meas. Tech.ChEMBL_1465177 (CHEMBL3405878)
IC50 474±n/a nM
Citation Yin, YZhang, YQJin, BSha, SWu, XSangani, CBWang, SFQiao, FLu, AMLv, PCZhu, HL 6,7-Dihydrobenzo[f]benzo[4,5]imidazo[1,2-d][1,4]oxazepine derivatives as selective inhibitors of PI3Ka. Bioorg Med Chem23:1231-40 (2015) 
 
Phosphatidylinositol 4,5-bisphosphate 3-kinase catalytic subunit alpha isoform
Name:Phosphatidylinositol 4,5-bisphosphate 3-kinase catalytic subunit alpha isoform
Type:Enzyme Subunit
Mol. Mass.:124294.87
Organism:Homo sapiens (Human)
Description:P42336
Residue:1068
BDBM50064859
NameBDBM50064859
Synonyms:CHEMBL3401243
TypeSmall organic molecule
Emp. Form.C16H13FN2O
Mol. Mass.268.2856
SMILESCc1ccc2OCCn3c(nc4cc(F)ccc34)-c2c1