Reaction Details
TargetTyrosine-protein kinase BTK
LigandBDBM50064868
Substrate/Competitorn/a
Meas. Tech.ChEMBL_1465191 (CHEMBL3406075)
IC50 1100±n/a nM
Citation Young, WBBarbosa, JBlomgren, PBremer, MCCrawford, JJDambach, DGallion, SHymowitz, SGKropf, JELee, SHLiu, LLubach, JWMacaluso, JMaciejewski, PMaurer, BMitchell, SAOrtwine, DFDi Paolo, JReif, KScheerens, HSchmitt, ASowell, CGWang, XWong, HXiong, JMXu, JZhao, ZCurrie, KS Potent and selective Bruton's tyrosine kinase inhibitors: discovery of GDC-0834. Bioorg Med Chem Lett25:1333-7 (2015) 
 
Tyrosine-protein kinase BTK
Name:Tyrosine-protein kinase BTK
Type:PROTEIN
Mol. Mass.:76447.19
Organism:Mus musculus
Description:ChEMBL_108319
Residue:659
BDBM50064868
NameBDBM50064868
Synonyms:CHEMBL3401286
TypeSmall organic molecule
Emp. Form.C29H27N5O2S
Mol. Mass.509.622
SMILESCc1c(NC(=O)c2cc3CCCCc3s2)cccc1-c1cn(C)c(=O)c(Nc2ccc3[nH]ccc3c2)n1