Reaction Details
TargetTyrosine-protein kinase BTK
LigandBDBM50064876
Substrate/Competitorn/a
Meas. Tech.ChEMBL_1465191 (CHEMBL3406075)
IC50 80±n/a nM
Citation Young, WBBarbosa, JBlomgren, PBremer, MCCrawford, JJDambach, DGallion, SHymowitz, SGKropf, JELee, SHLiu, LLubach, JWMacaluso, JMaciejewski, PMaurer, BMitchell, SAOrtwine, DFDi Paolo, JReif, KScheerens, HSchmitt, ASowell, CGWang, XWong, HXiong, JMXu, JZhao, ZCurrie, KS Potent and selective Bruton's tyrosine kinase inhibitors: discovery of GDC-0834. Bioorg Med Chem Lett25:1333-7 (2015) 
 
Tyrosine-protein kinase BTK
Name:Tyrosine-protein kinase BTK
Type:PROTEIN
Mol. Mass.:76447.19
Organism:Mus musculus
Description:ChEMBL_108319
Residue:659
BDBM50064876
NameBDBM50064876
Synonyms:CHEMBL3401267
TypeSmall organic molecule
Emp. Form.C35H39N5O4
Mol. Mass.593.7153
SMILESCCC(C)(C)c1ccc(cc1)C(=O)Nc1cccc(c1C)-c1cn(C)c(=O)c(Nc2ccc(cc2)C(=O)N2CCOCC2)n1