Reaction Details
Target5-hydroxytryptamine receptor 2B
LigandBDBM86029
Substrate/Competitorn/a
Meas. Tech.ChEMBL_1465387 (CHEMBL3406943)
Ki 240±n/a nM
Citation Sakhuja, RKondabolu, KCórdova-Sintjago, TTravers, SVincek, ASKim, MSAbboud, KAFang, LSun, ZCanal, CEBooth, RG Novel 4-substituted-N,N-dimethyltetrahydronaphthalen-2-amines: synthesis, affinity, and in silico docking studies at serotonin 5-HT2-type and histamine H1 G protein-coupled receptors. Bioorg Med Chem23:1588-600 (2015) 
 
5-hydroxytryptamine receptor 2B
Name:5-hydroxytryptamine receptor 2B
Type:G Protein-Coupled Receptor (GPCR)
Mol. Mass.:54312.47
Organism:Homo sapiens (Human)
Description:Receptor binding assays were performed using human clone stably expressed in CHO cells.
Residue:481
BDBM86029
NameBDBM86029
Synonyms:trans-H2-PAT(+)
TypeSmall organic molecule
Emp. Form.C18H21N
Mol. Mass.251.366
SMILESCN(C)[C@@H]1C[C@@H](c2ccccc2)c2ccccc2C1