Reaction Details
Target5-hydroxytryptamine receptor 2C
LigandBDBM50065036
Substrate/Competitorn/a
Meas. Tech.ChEMBL_1465388 (CHEMBL3406944)
Ki 7.0±n/a nM
Citation Sakhuja, RKondabolu, KCórdova-Sintjago, TTravers, SVincek, ASKim, MSAbboud, KAFang, LSun, ZCanal, CEBooth, RG Novel 4-substituted-N,N-dimethyltetrahydronaphthalen-2-amines: synthesis, affinity, and in silico docking studies at serotonin 5-HT2-type and histamine H1 G protein-coupled receptors. Bioorg Med Chem23:1588-600 (2015) 
 
5-hydroxytryptamine receptor 2C
Name:5-hydroxytryptamine receptor 2C
Type:G Protein-Coupled Receptor (GPCR)
Mol. Mass.:51836.79
Organism:Homo sapiens (Human)
Description:P28335
Residue:458
BDBM50065036
NameBDBM50065036
Synonyms:CHEMBL3402656
TypeSmall organic molecule
Emp. Form.C18H28ClN
Mol. Mass.293.875
SMILESCl.CN(C)[C@H]1C[C@H](C2CCCCC2)c2ccccc2C1