Reaction Details
TargetHistamine H3 receptor
LigandBDBM50065026
Substrate/Competitorn/a
Meas. Tech.ChEMBL_1465389 (CHEMBL3406945)
Ki 8.0±n/a nM
Citation Sakhuja, RKondabolu, KCórdova-Sintjago, TTravers, SVincek, ASKim, MSAbboud, KAFang, LSun, ZCanal, CEBooth, RG Novel 4-substituted-N,N-dimethyltetrahydronaphthalen-2-amines: synthesis, affinity, and in silico docking studies at serotonin 5-HT2-type and histamine H1 G protein-coupled receptors. Bioorg Med Chem23:1588-600 (2015) 
 
Histamine H3 receptor
Name:Histamine H3 receptor
Type:G Protein-Coupled Receptor (GPCR)
Mol. Mass.:48691.47
Organism:Homo sapiens (Human)
Description:Binding assays were using CHO cells stably expressing hH3R receptors.
Residue:445
BDBM50065026
NameBDBM50065026
Synonyms:CHEMBL3402665
TypeSmall organic molecule
Emp. Form.C18H21Cl2N
Mol. Mass.322.272
SMILESCl.CN(C)[C@H]1C[C@H](c2ccc(Cl)cc2)c2ccccc2C1