Reaction Details
TargetC-X-C chemokine receptor type 2
LigandBDBM50371784
Substrate/Competitorn/a
Meas. Tech.ChEMBL_1465563 (CHEMBL3404716)
IC50 1.000000±n/a nM
Citation Austin, RPBennion, CBonnert, RVCheema, LCook, ARCox, RJEbden, MRGaw, AGrime, KMeghani, PNicholls, DPhillips, CSmith, NSteele, JStonehouse, JP Discovery and evaluation of a novel monocyclic series of CXCR2 antagonists. Bioorg Med Chem Lett25:1616-20 (2015) 
 
C-X-C chemokine receptor type 2
Name:C-X-C chemokine receptor type 2
Type:Protein
Mol. Mass.:40767.88
Organism:Homo sapiens (Human)
Description:P25025
Residue:360
BDBM50371784
NameBDBM50371784
Synonyms:CHEMBL446458
TypeSmall organic molecule
Emp. Form.C15H14F2N4O2S2
Mol. Mass.384.424
SMILESC[C@H](CO)Nc1[nH]c(SCc2cccc(F)c2F)nc2nc(=O)sc12