Reaction Details
TargetC-X-C chemokine receptor type 2
LigandBDBM50065247
Substrate/Competitorn/a
Meas. Tech.ChEMBL_1465563 (CHEMBL3404716)
IC50 794±n/a nM
Citation Austin, RPBennion, CBonnert, RVCheema, LCook, ARCox, RJEbden, MRGaw, AGrime, KMeghani, PNicholls, DPhillips, CSmith, NSteele, JStonehouse, JP Discovery and evaluation of a novel monocyclic series of CXCR2 antagonists. Bioorg Med Chem Lett25:1616-20 (2015) 
 
C-X-C chemokine receptor type 2
Name:C-X-C chemokine receptor type 2
Type:Protein
Mol. Mass.:40767.88
Organism:Homo sapiens (Human)
Description:P25025
Residue:360
BDBM50065247
NameBDBM50065247
Synonyms:CHEMBL3403829
TypeSmall organic molecule
Emp. Form.C16H20N4O4S2
Mol. Mass.396.484
SMILESC[C@H](CO)Nc1cc(nc(SCc2ccccc2)n1)C(=O)NS(C)(=O)=O