Reaction Details
TargetC-X-C chemokine receptor type 2
LigandBDBM50065265
Substrate/Competitorn/a
Meas. Tech.ChEMBL_1465563 (CHEMBL3404716)
IC50 158±n/a nM
Citation Austin, RPBennion, CBonnert, RVCheema, LCook, ARCox, RJEbden, MRGaw, AGrime, KMeghani, PNicholls, DPhillips, CSmith, NSteele, JStonehouse, JP Discovery and evaluation of a novel monocyclic series of CXCR2 antagonists. Bioorg Med Chem Lett25:1616-20 (2015) 
 
C-X-C chemokine receptor type 2
Name:C-X-C chemokine receptor type 2
Type:Protein
Mol. Mass.:40767.88
Organism:Homo sapiens (Human)
Description:P25025
Residue:360
BDBM50065265
NameBDBM50065265
Synonyms:CHEMBL3403838
TypeSmall organic molecule
Emp. Form.C17H24N4O3S2
Mol. Mass.396.527
SMILESCCCS(=O)(=O)Nc1cc(N[C@H](C)CO)nc(SCc2ccccc2)n1