Reaction Details
TargetC-X-C chemokine receptor type 2
LigandBDBM50065270
Substrate/Competitorn/a
Meas. Tech.ChEMBL_1465563 (CHEMBL3404716)
IC50 25±n/a nM
Citation Austin, RPBennion, CBonnert, RVCheema, LCook, ARCox, RJEbden, MRGaw, AGrime, KMeghani, PNicholls, DPhillips, CSmith, NSteele, JStonehouse, JP Discovery and evaluation of a novel monocyclic series of CXCR2 antagonists. Bioorg Med Chem Lett25:1616-20 (2015) 
 
C-X-C chemokine receptor type 2
Name:C-X-C chemokine receptor type 2
Type:Protein
Mol. Mass.:40767.88
Organism:Homo sapiens (Human)
Description:P25025
Residue:360
BDBM50065270
NameBDBM50065270
Synonyms:CHEMBL3403843
TypeSmall organic molecule
Emp. Form.C21H21N5O3S2
Mol. Mass.455.553
SMILESC[C@H](CO)Nc1cc(NS(=O)(=O)c2ccc(cc2)C#N)nc(SCc2ccccc2)n1