Reaction Details
TargetC-X-C chemokine receptor type 2
LigandBDBM50065329
Substrate/Competitorn/a
Meas. Tech.ChEMBL_1465563 (CHEMBL3404716)
IC50 7.9±n/a nM
Citation Austin, RPBennion, CBonnert, RVCheema, LCook, ARCox, RJEbden, MRGaw, AGrime, KMeghani, PNicholls, DPhillips, CSmith, NSteele, JStonehouse, JP Discovery and evaluation of a novel monocyclic series of CXCR2 antagonists. Bioorg Med Chem Lett25:1616-20 (2015) 
 
C-X-C chemokine receptor type 2
Name:C-X-C chemokine receptor type 2
Type:Protein
Mol. Mass.:40767.88
Organism:Homo sapiens (Human)
Description:P25025
Residue:360
BDBM50065329
NameBDBM50065329
Synonyms:CHEMBL3403853
TypeSmall organic molecule
Emp. Form.C19H25F2N5O3S2
Mol. Mass.473.56
SMILESC[C@H](CO)Nc1cc(NS(=O)(=O)N2CCCCC2)nc(SCc2cccc(F)c2F)n1