Reaction Details
TargetLysine-specific histone demethylase 1A
LigandBDBM50065386
Substrate/Competitorn/a
Meas. Tech.ChEMBL_1465740 (CHEMBL3405675)
IC50 4800±n/a nM
Citation Nowotarski, SLPachaiyappan, BHolshouser, SLKutz, CJLi, YHuang, YSharma, SKCasero, RAWoster, PM Structure-activity study for (bis)ureidopropyl- and (bis)thioureidopropyldiamine LSD1 inhibitors with 3-5-3 and 3-6-3 carbon backbone architectures. Bioorg Med Chem23:1601-12 (2015) 
 
Lysine-specific histone demethylase 1A
Name:Lysine-specific histone demethylase 1A
Type:Enzyme
Mol. Mass.:92901.01
Organism:Homo sapiens (Human)
Description:O60341
Residue:852
BDBM50065386
NameBDBM50065386
Synonyms:CHEMBL3401327
TypeSmall organic molecule
Emp. Form.C43H59ClN6S2
Mol. Mass.759.552
SMILESCl.S=C(NCCCNCCCCCNCCCNC(=S)NCCC(c1ccccc1)c1ccccc1)NCCC(c1ccccc1)c1ccccc1