Reaction Details
TargetAmine oxidase [flavin-containing] A
LigandBDBM50113851
Substrate/Competitorn/a
Meas. Tech.ChEMBL_1465742 (CHEMBL3405677)
IC50 4000±n/a nM
Citation Nowotarski, SLPachaiyappan, BHolshouser, SLKutz, CJLi, YHuang, YSharma, SKCasero, RAWoster, PM Structure-activity study for (bis)ureidopropyl- and (bis)thioureidopropyldiamine LSD1 inhibitors with 3-5-3 and 3-6-3 carbon backbone architectures. Bioorg Med Chem23:1601-12 (2015) 
 
Amine oxidase [flavin-containing] A
Name:Amine oxidase [flavin-containing] A
Type:Protein
Mol. Mass.:59689.53
Organism:Homo sapiens (Human)
Description:P21397
Residue:527
BDBM50113851
NameBDBM50113851
Synonyms:(+/-)-Tranylcypromine 2-Phenyl-cyclopropylamine CHEMBL313833 Tranylcypromine,(+) US8609708, 6 Tranyl- cypromine | US8609708, 6 Tranylcypromine
TypeSmall organic molecule
Emp. Form.C9H11N
Mol. Mass.133.1903
SMILESNC1CC1c1ccccc1