Reaction Details
TargetAmine oxidase [flavin-containing] B
LigandBDBM50065384
Substrate/Competitorn/a
Meas. Tech.ChEMBL_1465744 (CHEMBL3405679)
IC50 36000±n/a nM
Citation Nowotarski, SLPachaiyappan, BHolshouser, SLKutz, CJLi, YHuang, YSharma, SKCasero, RAWoster, PM Structure-activity study for (bis)ureidopropyl- and (bis)thioureidopropyldiamine LSD1 inhibitors with 3-5-3 and 3-6-3 carbon backbone architectures. Bioorg Med Chem23:1601-12 (2015) 
 
Amine oxidase [flavin-containing] B
Name:Amine oxidase [flavin-containing] B
Type:Protein
Mol. Mass.:58768.76
Organism:Homo sapiens (Human)
Description:P27338
Residue:520
BDBM50065384
NameBDBM50065384
Synonyms:CHEMBL3401325
TypeSmall organic molecule
Emp. Form.C39H51ClN6S2
Mol. Mass.703.445
SMILESCl.S=C(NCCCNCCCCCNCCCNC(=S)NC(c1ccccc1)c1ccccc1)NC(c1ccccc1)c1ccccc1