Reaction Details
TargetHepatocyte growth factor receptor
LigandBDBM50065506
Substrate/Competitorn/a
Meas. Tech.ChEMBL_1466072 (CHEMBL3404455)
IC50 300±n/a nM
Citation Dorsch, DSchadt, OStieber, FMeyring, MGrädler, UBladt, FFriese-Hamim, MKnühl, CPehl, UBlaukat, A Identification and optimization of pyridazinones as potent and selective c-Met kinase inhibitors. Bioorg Med Chem Lett25:1597-602 (2015) 
 
Hepatocyte growth factor receptor
Name:Hepatocyte growth factor receptor
Type:Protein
Mol. Mass.:155559.73
Organism:Homo sapiens (Human)
Description:P08581
Residue:1390
BDBM50065506
NameBDBM50065506
Synonyms:CHEMBL3402744
TypeSmall organic molecule
Emp. Form.C19H15F2N3O3
Mol. Mass.371.3375
SMILESCOC(=O)Nc1cccc(Cn2nc(ccc2=O)-c2cc(F)cc(F)c2)c1