Reaction Details
TargetHepatocyte growth factor receptor
LigandBDBM50065456
Substrate/Competitorn/a
Meas. Tech.ChEMBL_1466072 (CHEMBL3404455)
IC50 400±n/a nM
Citation Dorsch, DSchadt, OStieber, FMeyring, MGrädler, UBladt, FFriese-Hamim, MKnühl, CPehl, UBlaukat, A Identification and optimization of pyridazinones as potent and selective c-Met kinase inhibitors. Bioorg Med Chem Lett25:1597-602 (2015) 
 
Hepatocyte growth factor receptor
Name:Hepatocyte growth factor receptor
Type:Protein
Mol. Mass.:155559.73
Organism:Homo sapiens (Human)
Description:P08581
Residue:1390
BDBM50065456
NameBDBM50065456
Synonyms:CHEMBL3402741
TypeSmall organic molecule
Emp. Form.C26H34N4O5S
Mol. Mass.514.637
SMILESCCN(CC)CCCOC(=O)Nc1cccc(CN2N=C(CSC2=O)c2ccc(OC)c(OC)c2)c1