Reaction Details
TargetLysophosphatidic acid receptor 1
LigandBDBM50065617
Substrate/Competitorn/a
Meas. Tech.ChEMBL_1463949 (CHEMBL3405601)
IC50>25000±n/a nM
Citation Kusumi, KShinozaki, KKanaji, TKurata, HNaganawa, AOtsuki, KMatsushita, TSekiguchi, TKakuuchi, ASeko, T Discovery of novel S1P2 antagonists. Part 1: discovery of 1,3-bis(aryloxy)benzene derivatives. Bioorg Med Chem Lett25:1479-82 (2015) 
 
Lysophosphatidic acid receptor 1
Name:Lysophosphatidic acid receptor 1
Type:Enzyme
Mol. Mass.:41120.55
Organism:Homo sapiens (Human)
Description:Q92633
Residue:364
BDBM50065617
NameBDBM50065617
Synonyms:CHEMBL3401389
TypeSmall organic molecule
Emp. Form.C29H34FN3O4
Mol. Mass.507.5964
SMILESCCC(CC)CC1(O)CCN(CC1)C(=O)Nc1cc(Oc2ccc(F)cc2)cc(Oc2cccnc2)c1