Reaction Details
TargetSphingosine 1-phosphate receptor 3
LigandBDBM50065610
Substrate/Competitorn/a
Meas. Tech.ChEMBL_1463950 (CHEMBL3405602)
IC50>800±n/a nM
Citation Kusumi, KShinozaki, KKanaji, TKurata, HNaganawa, AOtsuki, KMatsushita, TSekiguchi, TKakuuchi, ASeko, T Discovery of novel S1P2 antagonists. Part 1: discovery of 1,3-bis(aryloxy)benzene derivatives. Bioorg Med Chem Lett25:1479-82 (2015) 
 
Sphingosine 1-phosphate receptor 3
Name:Sphingosine 1-phosphate receptor 3
Type:G Protein-Coupled Receptor (GPCR)
Mol. Mass.:42278.13
Organism:Homo sapiens (Human)
Description:Q99500
Residue:378
BDBM50065610
NameBDBM50065610
Synonyms:CHEMBL3401382
TypeSmall organic molecule
Emp. Form.C30H36FN3O6S
Mol. Mass.585.687
SMILESCCC(CC)CC1(O)CCN(CC1)C(=O)Nc1cc(Oc2ccc(F)cc2)cc(Oc2ccc(cc2)S(N)(=O)=O)c1