Reaction Details
TargetSphingosine 1-phosphate receptor 3
LigandBDBM50065615
Substrate/Competitorn/a
Meas. Tech.ChEMBL_1463950 (CHEMBL3405602)
IC50>800±n/a nM
Citation Kusumi, KShinozaki, KKanaji, TKurata, HNaganawa, AOtsuki, KMatsushita, TSekiguchi, TKakuuchi, ASeko, T Discovery of novel S1P2 antagonists. Part 1: discovery of 1,3-bis(aryloxy)benzene derivatives. Bioorg Med Chem Lett25:1479-82 (2015) 
 
Sphingosine 1-phosphate receptor 3
Name:Sphingosine 1-phosphate receptor 3
Type:G Protein-Coupled Receptor (GPCR)
Mol. Mass.:42278.13
Organism:Homo sapiens (Human)
Description:Q99500
Residue:378
BDBM50065615
NameBDBM50065615
Synonyms:CHEMBL3401387
TypeSmall organic molecule
Emp. Form.C33H40FN3O5
Mol. Mass.577.6862
SMILESCCC(CC)CC1(O)CCN(CC1)C(=O)Nc1cc(Oc2ccc(F)cc2)cc(Oc2ccc(cc2)C(=O)N(C)C)c1