Reaction Details
TargetLysophosphatidic acid receptor 2
LigandBDBM50065608
Substrate/Competitorn/a
Meas. Tech.ChEMBL_1463951 (CHEMBL3405603)
IC50>26000±n/a nM
Citation Kusumi, KShinozaki, KKanaji, TKurata, HNaganawa, AOtsuki, KMatsushita, TSekiguchi, TKakuuchi, ASeko, T Discovery of novel S1P2 antagonists. Part 1: discovery of 1,3-bis(aryloxy)benzene derivatives. Bioorg Med Chem Lett25:1479-82 (2015) 
 
Lysophosphatidic acid receptor 2
Name:Lysophosphatidic acid receptor 2
Type:PROTEIN
Mol. Mass.:39103.44
Organism:Homo sapiens (Human)
Description:ChEMBL_1451385
Residue:351
BDBM50065608
NameBDBM50065608
Synonyms:CHEMBL3401380
TypeSmall organic molecule
Emp. Form.C31H34FN3O4
Mol. Mass.531.6178
SMILESCCC(CC)CC1(O)CCN(CC1)C(=O)Nc1cc(Oc2ccc(F)cc2)cc(Oc2ccc(cc2)C#N)c1