Reaction Details
TargetCarbonic anhydrase 1
LigandBDBM50065655
Substrate/Competitorn/a
Meas. Tech.ChEMBL_1464552 (CHEMBL3406053)
Ki>10000±n/a nM
Citation Grandane, ATanc, M?alubovskis, RSupuran, CT Synthesis of 6-aryl-substituted sulfocoumarins and investigation of their carbonic anhydrase inhibitory action. Bioorg Med Chem23:1430-6 (2015) 
 
Carbonic anhydrase 1
Name:Carbonic anhydrase 1
Type:Enzyme
Mol. Mass.:28873.37
Organism:Homo sapiens (Human)
Description:P00915
Residue:261
BDBM50065655
NameBDBM50065655
Synonyms:CHEMBL3402840
TypeSmall organic molecule
Emp. Form.C15H9F3O4S
Mol. Mass.342.29
SMILESFC(F)(F)Oc1ccc(cc1)-c1ccc2OS(=O)(=O)C=Cc2c1