Reaction Details
TargetCarbonic anhydrase 1
LigandBDBM50065648
Substrate/Competitorn/a
Meas. Tech.ChEMBL_1464552 (CHEMBL3406053)
Ki>10000±n/a nM
Citation Grandane, ATanc, M?alubovskis, RSupuran, CT Synthesis of 6-aryl-substituted sulfocoumarins and investigation of their carbonic anhydrase inhibitory action. Bioorg Med Chem23:1430-6 (2015) 
 
Carbonic anhydrase 1
Name:Carbonic anhydrase 1
Type:Enzyme
Mol. Mass.:28873.37
Organism:Homo sapiens (Human)
Description:P00915
Residue:261
BDBM50065648
NameBDBM50065648
Synonyms:CHEMBL3402834
TypeSmall organic molecule
Emp. Form.C15H12O3S
Mol. Mass.272.319
SMILESCc1ccc(cc1)-c1ccc2OS(=O)(=O)C=Cc2c1