Reaction Details
TargetCarbonic anhydrase 2
LigandBDBM50065656
Substrate/Competitorn/a
Meas. Tech.ChEMBL_1464553 (CHEMBL3406054)
Ki>10000±n/a nM
Citation Grandane, ATanc, M?alubovskis, RSupuran, CT Synthesis of 6-aryl-substituted sulfocoumarins and investigation of their carbonic anhydrase inhibitory action. Bioorg Med Chem23:1430-6 (2015) 
 
Carbonic anhydrase 2
Name:Carbonic anhydrase 2
Type:Enzyme
Mol. Mass.:29250.71
Organism:Homo sapiens (Human)
Description:P00918
Residue:260
BDBM50065656
NameBDBM50065656
Synonyms:CHEMBL3402839
TypeSmall organic molecule
Emp. Form.C17H16O4S
Mol. Mass.316.372
SMILESCC(C)Oc1ccc(cc1)-c1ccc2OS(=O)(=O)C=Cc2c1