Reaction Details
TargetCarbonic anhydrase 2
LigandBDBM50065652
Substrate/Competitorn/a
Meas. Tech.ChEMBL_1464553 (CHEMBL3406054)
Ki>10000±n/a nM
Citation Grandane, ATanc, M?alubovskis, RSupuran, CT Synthesis of 6-aryl-substituted sulfocoumarins and investigation of their carbonic anhydrase inhibitory action. Bioorg Med Chem23:1430-6 (2015) 
 
Carbonic anhydrase 2
Name:Carbonic anhydrase 2
Type:Enzyme
Mol. Mass.:29250.71
Organism:Homo sapiens (Human)
Description:P00918
Residue:260
BDBM50065652
NameBDBM50065652
Synonyms:CHEMBL3402843
TypeSmall organic molecule
Emp. Form.C15H9F3O3S
Mol. Mass.326.29
SMILESFC(F)(F)c1cccc(c1)-c1ccc2OS(=O)(=O)C=Cc2c1