Reaction Details
TargetCarbonic anhydrase 9
LigandBDBM50065658
Substrate/Competitorn/a
Meas. Tech.ChEMBL_1464612 (CHEMBL3406463)
Ki 10±n/a nM
Citation Grandane, ATanc, M?alubovskis, RSupuran, CT Synthesis of 6-aryl-substituted sulfocoumarins and investigation of their carbonic anhydrase inhibitory action. Bioorg Med Chem23:1430-6 (2015) 
 
Carbonic anhydrase 9
Name:Carbonic anhydrase 9
Type:Enzyme
Mol. Mass.:49669.03
Organism:Homo sapiens (Human)
Description:Catalytic domain of human cloned isozyme was used in the assay
Residue:459
BDBM50065658
NameBDBM50065658
Synonyms:CHEMBL3402837
TypeSmall organic molecule
Emp. Form.C14H9FO3S
Mol. Mass.276.283
SMILESFc1cccc(c1)-c1ccc2OS(=O)(=O)C=Cc2c1