Reaction Details
TargetCarbonic anhydrase 1
LigandBDBM50065991
Substrate/Competitorn/a
Meas. Tech.ChEMBL_1464737 (CHEMBL3407088)
Ki>10000±n/a nM
Citation Mojzych, MKarczmarzyk, ZWysocki, WCeruso, MSupuran, CTKry?tof, VUrbanczyk-Lipkowska, ZKalicki, P New approaches to the synthesis of sildenafil analogues and their enzyme inhibitory activity. Bioorg Med Chem23:1421-9 (2015) 
 
Carbonic anhydrase 1
Name:Carbonic anhydrase 1
Type:Enzyme
Mol. Mass.:28873.37
Organism:Homo sapiens (Human)
Description:P00915
Residue:261
BDBM50065991
NameBDBM50065991
Synonyms:CHEMBL3261387
TypeSmall organic molecule
Emp. Form.C19H25N7O3S
Mol. Mass.431.512
SMILESCCOc1ccc(cc1-c1nnc2n(C)nc(C)c2n1)S(=O)(=O)N1CCN(C)CC1