Reaction Details
TargetCarbonic anhydrase 9
LigandBDBM50065994
Substrate/Competitorn/a
Meas. Tech.ChEMBL_1464739 (CHEMBL3407090)
Ki 40±n/a nM
Citation Mojzych, MKarczmarzyk, ZWysocki, WCeruso, MSupuran, CTKry?tof, VUrbanczyk-Lipkowska, ZKalicki, P New approaches to the synthesis of sildenafil analogues and their enzyme inhibitory activity. Bioorg Med Chem23:1421-9 (2015) 
 
Carbonic anhydrase 9
Name:Carbonic anhydrase 9
Type:Enzyme
Mol. Mass.:49669.03
Organism:Homo sapiens (Human)
Description:Catalytic domain of human cloned isozyme was used in the assay
Residue:459
BDBM50065994
NameBDBM50065994
Synonyms:CHEMBL3261388
TypeSmall organic molecule
Emp. Form.C18H23N7O3S
Mol. Mass.417.485
SMILESCCOc1ccc(cc1-c1nnc2n(C)nc(C)c2n1)S(=O)(=O)N1CCNCC1