Reaction Details
TargetCarbonic anhydrase 9
LigandBDBM50066005
Substrate/Competitorn/a
Meas. Tech.ChEMBL_1464739 (CHEMBL3407090)
Ki 42±n/a nM
Citation Mojzych, MKarczmarzyk, ZWysocki, WCeruso, MSupuran, CTKry?tof, VUrbanczyk-Lipkowska, ZKalicki, P New approaches to the synthesis of sildenafil analogues and their enzyme inhibitory activity. Bioorg Med Chem23:1421-9 (2015) 
 
Carbonic anhydrase 9
Name:Carbonic anhydrase 9
Type:Enzyme
Mol. Mass.:49669.03
Organism:Homo sapiens (Human)
Description:Catalytic domain of human cloned isozyme was used in the assay
Residue:459
BDBM50066005
NameBDBM50066005
Synonyms:CHEMBL3357169
TypeSmall organic molecule
Emp. Form.C18H24N6O3S
Mol. Mass.404.487
SMILESCCOc1ccc(cc1-c1nnc2n(C)nc(C)c2n1)S(=O)(=O)N(CC)CC