Reaction Details
TargetCarbonic anhydrase 12
LigandBDBM50066008
Substrate/Competitorn/a
Meas. Tech.ChEMBL_1464740 (CHEMBL3407091)
Ki 5.5±n/a nM
Citation Mojzych, MKarczmarzyk, ZWysocki, WCeruso, MSupuran, CTKry?tof, VUrbanczyk-Lipkowska, ZKalicki, P New approaches to the synthesis of sildenafil analogues and their enzyme inhibitory activity. Bioorg Med Chem23:1421-9 (2015) 
 
Carbonic anhydrase 12
Name:Carbonic anhydrase 12
Type:Enzyme
Mol. Mass.:39456.00
Organism:Homo sapiens (Human)
Description:Catalytic domain of human cloned isozyme was used in the assay
Residue:354
BDBM50066008
NameBDBM50066008
Synonyms:CHEMBL3401465
TypeSmall organic molecule
Emp. Form.C14H16N6O3S
Mol. Mass.348.38
SMILESCCOc1ccc(cc1-c1nnc2n(C)nc(C)c2n1)S(N)(=O)=O