Reaction Details
TargetCarbonic anhydrase 1
LigandBDBM50066119
Substrate/Competitorn/a
Meas. Tech.ChEMBL_1465099 (CHEMBL3405431)
Ki 34±n/a nM
Citation Carta, FDi Cesare Mannelli, LPinard, MGhelardini, CScozzafava, AMcKenna, RSupuran, CT A class of sulfonamide carbonic anhydrase inhibitors with neuropathic pain modulating effects. Bioorg Med Chem23:1828-40 (2015) 
 
Carbonic anhydrase 1
Name:Carbonic anhydrase 1
Type:Enzyme
Mol. Mass.:28873.37
Organism:Homo sapiens (Human)
Description:P00915
Residue:261
BDBM50066119
NameBDBM50066119
Synonyms:CHEMBL3402974
TypeSmall organic molecule
Emp. Form.C10H9F3N2O3S
Mol. Mass.294.25
SMILESNS(=O)(=O)c1ccc2N(CCc2c1)C(=O)C(F)(F)F