Reaction Details
TargetCarbonic anhydrase 1
LigandBDBM50066124
Substrate/Competitorn/a
Meas. Tech.ChEMBL_1465099 (CHEMBL3405431)
Ki 3450±n/a nM
Citation Carta, FDi Cesare Mannelli, LPinard, MGhelardini, CScozzafava, AMcKenna, RSupuran, CT A class of sulfonamide carbonic anhydrase inhibitors with neuropathic pain modulating effects. Bioorg Med Chem23:1828-40 (2015) 
 
Carbonic anhydrase 1
Name:Carbonic anhydrase 1
Type:Enzyme
Mol. Mass.:28873.37
Organism:Homo sapiens (Human)
Description:P00915
Residue:261
BDBM50066124
NameBDBM50066124
Synonyms:CHEMBL3402968
TypeSmall organic molecule
Emp. Form.C15H13NO3S
Mol. Mass.287.334
SMILESNS(=O)(=O)c1ccc(OCC#Cc2ccccc2)cc1