Reaction Details
TargetCarbonic anhydrase 1
LigandBDBM50066127
Substrate/Competitorn/a
Meas. Tech.ChEMBL_1465099 (CHEMBL3405431)
Ki 246±n/a nM
Citation Carta, FDi Cesare Mannelli, LPinard, MGhelardini, CScozzafava, AMcKenna, RSupuran, CT A class of sulfonamide carbonic anhydrase inhibitors with neuropathic pain modulating effects. Bioorg Med Chem23:1828-40 (2015) 
 
Carbonic anhydrase 1
Name:Carbonic anhydrase 1
Type:Enzyme
Mol. Mass.:28873.37
Organism:Homo sapiens (Human)
Description:P00915
Residue:261
BDBM50066127
NameBDBM50066127
Synonyms:CHEMBL3402965
TypeSmall organic molecule
Emp. Form.C13H12BrNO3S
Mol. Mass.342.208
SMILESNS(=O)(=O)c1ccc(OCc2ccc(Br)cc2)cc1