Reaction Details
TargetCarbonic anhydrase 1
LigandBDBM50066133
Substrate/Competitorn/a
Meas. Tech.ChEMBL_1465099 (CHEMBL3405431)
Ki 797±n/a nM
Citation Carta, FDi Cesare Mannelli, LPinard, MGhelardini, CScozzafava, AMcKenna, RSupuran, CT A class of sulfonamide carbonic anhydrase inhibitors with neuropathic pain modulating effects. Bioorg Med Chem23:1828-40 (2015) 
 
Carbonic anhydrase 1
Name:Carbonic anhydrase 1
Type:Enzyme
Mol. Mass.:28873.37
Organism:Homo sapiens (Human)
Description:P00915
Residue:261
BDBM50066133
NameBDBM50066133
Synonyms:CHEMBL1338403
TypeSmall organic molecule
Emp. Form.C10H15NO3S
Mol. Mass.229.296
SMILESCCCCOc1ccc(cc1)S(N)(=O)=O