Reaction Details
TargetCarbonic anhydrase 2
LigandBDBM50066129
Substrate/Competitorn/a
Meas. Tech.ChEMBL_1465100 (CHEMBL3405432)
Ki 24±n/a nM
Citation Carta, FDi Cesare Mannelli, LPinard, MGhelardini, CScozzafava, AMcKenna, RSupuran, CT A class of sulfonamide carbonic anhydrase inhibitors with neuropathic pain modulating effects. Bioorg Med Chem23:1828-40 (2015) 
 
Carbonic anhydrase 2
Name:Carbonic anhydrase 2
Type:Enzyme
Mol. Mass.:29250.71
Organism:Homo sapiens (Human)
Description:P00918
Residue:260
BDBM50066129
NameBDBM50066129
Synonyms:CHEMBL3402963
TypeSmall organic molecule
Emp. Form.C13H12FNO3S
Mol. Mass.281.303
SMILESNS(=O)(=O)c1ccc(OCc2ccc(F)cc2)cc1