Reaction Details
TargetCarbonic anhydrase 2
LigandBDBM50066127
Substrate/Competitorn/a
Meas. Tech.ChEMBL_1465100 (CHEMBL3405432)
Ki 28±n/a nM
Citation Carta, FDi Cesare Mannelli, LPinard, MGhelardini, CScozzafava, AMcKenna, RSupuran, CT A class of sulfonamide carbonic anhydrase inhibitors with neuropathic pain modulating effects. Bioorg Med Chem23:1828-40 (2015) 
 
Carbonic anhydrase 2
Name:Carbonic anhydrase 2
Type:Enzyme
Mol. Mass.:29250.71
Organism:Homo sapiens (Human)
Description:P00918
Residue:260
BDBM50066127
NameBDBM50066127
Synonyms:CHEMBL3402965
TypeSmall organic molecule
Emp. Form.C13H12BrNO3S
Mol. Mass.342.208
SMILESNS(=O)(=O)c1ccc(OCc2ccc(Br)cc2)cc1